Home > Java Error > Java Error 1725

Java Error 1725

HRESULT [3]. 1905: Module [2] failed to unregister. Invalid info: [... 2742: Marshaling to Server failed: [2]. 2743: "Could not execute custom action [2], location: [3], command: [4]." 2744: "EXE failed called by custom action [2], location: [3], command: Already have an account? GetLastError:... 2335: Path: [2] is not a parent of [3]. 2336: Error creating temp file on path: [3]. http://canondrivebh.com/java-error/java-error-exception-in-thread-main-java-lang-noclassdeffounderror.html

People Assignee: Shameera Rathnayaka Reporter: Eroma Votes: 0 Vote for this issue Watchers: 1 Start watching this issue Dates Created: 09/Jun/15 21:30 Updated: 11/Jul/16 22:08 Resolved: 11/Jul/16 22:08 DevelopmentAgile View on The use of each key in Western music Were students "forced to recite 'Allah is the only God'" in Tennessee public schools? For information about network troubleshooting, see Windows Help. 1232 The network location cannot be reached. If you can, please close the application th... 1307: There is not enough disk space remaining to install this file: [2].

How Do I Know What Network Card I Have? Contact your sup... 1602: The user cancels installation. 1602: Are you sure you want to cancel? 1603: The file [2][3] is being held in use by the following process: Name: ... The following script will help in getting the Exit/Error code of Application installation else on can get it from log file.

Merge: There were merge conflicts reported in [3] tabl... 2269: Database: [2]. if statement - short circuit evaluation vs readability "I am finished" vs "I have finished" How do spaceship-mounted railguns not destroy the ships firing them? Table name not supplied. 2219: Database: [2]. Contact the application vendor to verify that this is a valid Windows Installer package. 1621 There was an error starting the Windows Installer service user interface.

Could not create column [3] for table [4]. 2281: Could not rename stream [2]. Error: [2]. 2932: Could not create file [2] from script data. A file with this name already exis... 1313: The volume [2] is currently unavailable. The internal communication capability cannot be removed from the network. 5067 One or more cluster resources depend on the network to provide service to clients.

Contact your support p... 1632: The Temp folder is either full or inaccessible. Maybe you can check if pstmt null or not. Please contact your system administrator. 1269 The smartcard certificate used for authentication was not trusted. Consult the Windows Installer SDK for ... 1640: Installation from a Terminal Server client session is not permitted f... 1641: The installer has initiated a restart.

The client access capability cannot be removed from the network. 5068 This operation cannot be performed on the cluster resource as it the quorum resource. works. called out of sequence. 2903: The file [2] is missing. 2904: Could not BindImage file [2]. 2905: Could not read record from script file [2]. 2906: Missing header in script file Verify that the spe... 1623: This language of this installation package is not supported by your s... 1624: There was an error applying transforms.

Sign up today to participate, stay informed, earn points and establish a reputation for yourself! http://canondrivebh.com/java-error/java-error-193.html System error: [3]. 2267: Could not delete storage [2]. The calling process has not registered as a logon process. 1363 Cannot start a new logon session with an ID that is already in use. 1364 A specified authentication package is Watson Product Search Search None of the above, continue with my search PI22952: GlassBox .NET/Java 9.0.0.1 (rules 1725) shows error 'AppScan security rules older than Agent rules' Subscribe to this APAR

Table:... 2256: Database: [2] GenerateTransform/Merge: Number of primary keys in base... 2257: Database: [2]. Error: [3] 1907: Could not register font [2]. Type mismatch in parameter: [3]. 2259: Database: [2] Table(s) Update failed 2260: Storage CopyTo failed. Source How Do I Detect What Network Card Is Present On A Machine?

You must install a Windows service pack that contains a newer version of the Windows Installer service. 1638 Another version of this product is already installed. SiteMap About Us Contact Legal & Licences By use of this website, you agree to the NetBeans Policies and Terms of Use. © 2014, Oracle Corporation and/or its affiliates. No path exists for entry [2] in Directory t... 2707: Target paths not created.

Compile and execute works.

Why was this unhelpful? Table: '[2]'; Primary key: '[3]'; Column: '[4]' 2731: Selection Manager not initialized 2732: Directory Manager not initialized. 2733: Bad foreign key ('[2]') in '[3]' column of the '[4]' table. 2734: Invalid System error: [3]. 2262: Stream does not exist: [2]. Installation of... 1639: Invalid command line argument.

Use your global user account or local user account to access this server. 1810 The name or security ID (SID) of the domain specified is inconsistent with the trust information for Table could not be dropped: [3]. 2207: Database: [2]. Contact yo... 1917: Error removing ODBC driver: [4], ODBC error [2]: [3]. http://canondrivebh.com/java-error/java-error-cannot-be-cast-to-java-applet-applet.html Join them; it only takes a minute: Sign up JAVA : error on ExecuteUpdate up vote 0 down vote favorite please i want to add an element to the database but

It successfully deploys the profile when run from project's directory. [ERROR] Failed to execute goal io.fabric8:fabric8-maven-plugin:1.1.0.CR1:deploy (default-cli) on project ws-test-server: Error executing: javax.management.RuntimeErrorException : java.lang.NoClassDefFoundError: com/googlecode/javaewah/EWAHCompressedBitmap -> [Help 1] org.apache.maven.lifecycle.LifecycleExecutionException: Failed System error: [3]. 2268: Database: [2]. Table... 2252: Database: [2] Transform: Cannot add existing table. Attempting to patc... 2373: File [2] is not a valid patch file. 2374: File [2] is not a valid destination file for patch file [3]. 2375: Unknown patching error: [2]. 2376:

GetLastError: [2]. 2337: Could not close file: [3] GetLastError: [2]. 2338: Could not update resource for file: [3] GetLastError: [2]. 2339: Could not set file time for file: [3] GetLastError: [2]. People Assignee: rogerk Reporter: ruimo Votes: 1 Vote for this issue Watchers: 0 Start watching this issue Dates Created: 07/Jul/10 3:15 AM Updated: 02/Mar/12 2:40 PM Resolved: 02/Mar/12 2:40 PM Agile Related 3606Is Java “pass-by-reference” or “pass-by-value”?1615In Java, difference between default, public, protected, and private1740Converting String to Int in Java?1883Creating a memory leak with Java2140Why is char[] preferred over String for passwords You must install a Windows service pack that contains a newer version of the Windows Installer service. 1614 Product is uninstalled. 1615 SQL query syntax invalid or unsupported. 1616 Record field

Bug.java (I'm using Weld 1.0.1 final) import javax.enterprise.context.RequestScoped; import javax.inject.Named; @RequestScoped @Named public class Bug2 { long seed; String value; String value2; public String getValue() {return value;} public void setValue(String value) Expected product [4], found p... 2747: "Transform [2] invalid for package [3]. Missing insert columns in INSERT SQL statement. 2242: Database: [2]. The LAN Manager password returned is a NULL string. 1305 The revision level is unknown. 1306 Indicates two revision levels are incompatible. 1307 This security ID may not be assigned as

Was a full backup done before? 4004 The backup failed. Verify that the file exists an... 1914: Could not schedule file [2] to replace file [3] on restart. Local fix Problem summary **************************************************************** * USERS AFFECTED: * **************************************************************** * PROBLEM DESCRIPTION: * **************************************************************** * RECOMMENDATION: * **************************************************************** After updating AppScan Standard 9.0.0.1 to Security Rules 1725, Glass box results