Home > Error In > Error In Opening Zip File Java

Error In Opening Zip File Java

Contents

Sorry for inconvenience caused.Let us know if you have any questions. Might be a silly question, but how did you import your jar? It then still failed on the asm-parent, which was a POM file containing the HTML with a 301. Please share the .log file which is located at /.metadata/.log and send it over to help us investigate further. http://canondrivebh.com/error-in/caused-by-java-lang-illegalargumentexception-java-util-zip-zipexception-error-in-opening-zip-file.html

How to translate "sink" in "carbon sink" or when dealing with electric fields Find the Infinity Words! Get the weekly newsletter! Why aren't sessions exclusive to an IP address? Viewing 15 posts - 1 through 15 (of 15 total) Author Posts February 27, 2014 at 3:48 pm #347605 Reply trantParticipant I tried to import an existing Maven project using the

Error In Opening Zip File Java

You signed out in another tab or window. Maven has pulled down some html content describing an error and saved it to a jar file. –Shellum Jul 7 '15 at 15:41 add a comment| up vote 27 down vote Has anyone resolved it? SUCCESS [0.373s] [INFO] core ..............................................

Let us know how it works for you. 1. asked 5 years ago viewed 55537 times active 5 months ago Blog Stack Overflow Podcast #91 - Can You Stump Nick Craver? Comment People who like this Close 0 Show 5 Share 10 |3000 characters needed characters left characters exceeded Viewable by all users Viewable by moderators Viewable by moderators Maven-clean-plugin-2.4.1.jar) Error In Opening Zip File asked 2 years ago viewed 6238 times active 5 months ago Blog Stack Overflow Podcast #91 - Can You Stump Nick Craver?

Browse other questions tagged java hibernate maven log4j slf4j or ask your own question. share|improve this answer answered Jan 4 '12 at 20:31 Darkaico 56658 2 It seems not work,I delete the ./m2/repository folder again and again,but still fail. –janwen Jul 5 '12 at Chris Jenkins (1490) OliverRodriguez (7) Mar 19, 2015 at 11:29 AM 0 I'm not sure. Rename the file to .txt before attaching it.

But i get the following error: [ERROR] Error resolving version for plugin 'org.openmrs.maven.plugins:openmrs-sdk-maven-plugin' from the repositories [local (/home/m0dz3r0/.m2/repository), central (https://repo.maven.apache.org/maven2)]: Plugin not found in any plugin repository -> [Help 1] It Error In Opening Zip File Eclipse compile) then Run. Manually download xalan-2.7.1.jar Remove all files of: ~/.m2/repository/org/apache/xalan/xalan/2.7.1/ Copy the jar which is manually downloaded into the location: ~/.m2/repository/org/apache/xalan/xalan/2.7.1/ $ cp xalan-2.7.1.jar ~/.m2/repository/org/apache/xalan/xalan/2.7.1/ Its Doneā€¦ Try to execute your mvn clean Any help will be appreciated.

  1. Finding the distance between two points in C++ Is it possible to keep publishing under my professional (maiden) name, different from my married legal name?
  2. I found a 302.
  3. Related 446How to add local jar files in maven project?394How to fix error “Updating Maven Project”.
  4. The -U parameter forces maven to update. –PaoloVictor Sep 29 '11 at 15:55 add a comment| 8 Answers 8 active oldest votes up vote 50 down vote Probably, contents of the
  5. string.find versus this function How to find positive things in a code review?
  6. Did you use the same one and just re-add it or did you find another?
  7. And I see that, on to the repository path in my disk, starting from servlet, no packages are being created inside repository.
  8. I am using separately download Maven 3.1.1 instead of embedded version.

Error In Opening Zip File Jenkins

March 4, 2014 at 9:38 am #347716 Reply trantParticipant @support-swapna wrote: trant, 1. What is the purpose of keepalive.aspx? Error In Opening Zip File Java maven pom.xml share|improve this question edited Aug 21 '14 at 21:51 asked Aug 21 '14 at 5:47 Begnnier 148110 Have you checked that the jar files exist and are Error In Opening Zip File Android Studio But when i run this test case in eclipse, i get no failures.

The build fails saying there are test failures. http://canondrivebh.com/error-in/error-in-opening-zip-file-during-maven-build.html That worked for me. –shashaDenovo Dec 13 '14 at 10:15 1 Worked good for me too... See the Maven Lifecycle Reference –Sean Patrick Floyd Mar 2 '12 at 7:27 Thanks, Sean I removed the useless things –subodh Mar 2 '12 at 7:40 add a comment| Standardisation of Time in a FTL Universe Why did Moody eat the school's sausages? Error In Opening Zip File Ant

What is the 'dot space filename' command doing in bash? You may want to check what settings XML to see if you're set to a different repository, such as a local nexus server. I am afraid I cannot provide any workaround for now to get your projects working on MyEclipse 2014. Source How does a migratory species farm?

Can you open the file in Notepad or vi and see what it looks like? Checksum Validation Failed Maven keyword2 keyword1 -keyword2 Questions with a specific tag and keyword(s) +[tag1] keyword1 Questions with two or more specific tags and keyword(s) +[tag1] +[tag2] keyword1 To search for all posts by a How to photograph distant objects (10km)?

SLF4J: Defaulting to no-operation (NOP) logger implementation SLF4J: See http://www.slf4j.org/codes.html#StaticLoggerBinder for further details.

How should I deal with a difficult group and a DM that doesn't help? share|improve this answer edited Jun 1 '14 at 11:04 gsamaras 20.2k163675 answered Jan 31 '14 at 10:14 Shilpa 106211 This worked for me, surprisingly enough. –Jared Jul 17 '14 Test set: org.openmrs.api.UserServiceTest ------------------------------------------------------------------------------- Tests run: 80, Failures: 1, Errors: 0, Skipped: 1, Time elapsed: 4.811 sec <<< FAILURE! - in org.openmrs.api.UserServiceTest getAllPrivileges_shouldReturnAllPrivilegesInTheSystem(org.openmrs.api.UserServiceTest) Time elapsed: 0.07 sec <<< FAILURE! Javac Error In Opening Zip File more hot questions question feed default about us tour help blog chat data legal privacy policy work here advertising info mobile contact us feedback Technology Life / Arts Culture / Recreation

Either this file is not a zipfile, or it constitutes one disk of a multi-part archive. I used the same version and got it working, after removing it and then reimporting. In it, you'll get: The week's top questions and answers Important community announcements Questions that need answers see an example newsletter By subscribing, you agree to the privacy policy and terms have a peek here In either event, your file being 2 KB would indicate a problem of some kind on your end or in your network.

We recommend upgrading to the latest Safari, Google Chrome, or Firefox. hope that help as this answer helped me. –German Attanasio Jul 21 '14 at 17:45 add a comment| up vote 0 down vote I was facing the same issue just now. Unsupported IClasspathEntry kind=4?1Maven Error spring-data-neo4j-rest-2.1.0.BUILD-SNAPSHOT.jar; cannot read zip file maven error3Maven project with PI4J library - error in opening zip file0Maven error message regarding missing package or class0Error opening zip file Running Maven with -X option forces it to try other servers to download source code.

March 3, 2014 at 10:07 am #347684 Reply trantParticipant OK, thank you for the explanation. A quick solution thats works for me, is: Go to your local repository (in general /.m2/) in your case I see that is C:\Users\suresh.m2) Search for the packages that makes conflicts java.runtime.name=Java(TM) SE Runtime Environment java.runtime.version=1.7.0_45-b18 java.specification.name=Java Platform API Specification java.specification.vendor=Oracle Corporation java.specification.version=1.7 java.vendor=Oracle Corporation java.vendor.url=http://java.oracle.com/ java.vendor.url.bug=http://bugreport.sun.com/bugreport/ java.version=1.7.0_45 java.vm.info=mixed mode java.vm.name=Java HotSpot(TM) 64-Bit Server VM java.vm.specification.name=Java Virtual Machine Specification java.vm.specification.vendor=Oracle Corporation java.vm.specification.version=1.7 So i am trying to install without skipping these tests.

Rename the file to .txt before attaching it. 1.